BDBM22193 1-{4-[2-(diphenylmethoxy)ethyl]piperazin-1-yl}-2-methyl-3-phenylpropan-2-ol::GBR 12935 Analogue, 22
SMILES CC(O)(CN1CCN(CCOC(c2ccccc2)c2ccccc2)CC1)Cc1ccccc1
InChI Key InChIKey=JUOTXFDGIKRFRE-UHFFFAOYSA-N
Data  2 KI
  Tab Delimited (TSV)   2D SDfile   Computed 3D by Vconf -m prep SDfile
Find this compound or compounds like it in BindingDB:
Activity Spreadsheet -- Enzyme Inhibition Constant Data from BindingDB
Found 2 hits for monomerid = 22193
TargetSodium-dependent dopamine transporter(Rattus norvegicus (rat))
National Taiwan University
LigandPNGBDBM22193(1-{4-[2-(diphenylmethoxy)ethyl]piperazin-1-yl}-2-m...)
Affinity DataKi:  150nM. Assay description: The assay was initiated by the addition of membranes to binding buffer containing test compound, blocker, and radioligand. The samples were incubated...
In DepthDetails ArticlePubMed
TargetSodium-dependent serotonin transporter(Rattus norvegicus (rat))
National Taiwan University
LigandPNGBDBM22193(1-{4-[2-(diphenylmethoxy)ethyl]piperazin-1-yl}-2-m...)
Affinity DataKi:  2.00E+3nM. Assay description: The assay was initiated by the addition of membranes to binding buffer containing test compound, blocker, and radioligand. The samples were incubated...
In DepthDetails ArticlePubMed