BDBM222011 N-((1-(4-fluorobenzyl)-1H-1,2,3-triazol-5-yl)methyl)-2-oxo-2H-chromene-3-carboxamide (6e)
SMILES Fc1ccc(Cn2nncc2CNC(=O)c2cc3ccccc3oc2=O)cc1
InChI Key InChIKey=UMYAGJPXILAGQQ-UHFFFAOYSA-N
Data  2 IC50
  Tab Delimited (TSV)   2D SDfile   Computed 3D by Vconf -m prep SDfile
Find this compound or compounds like it in BindingDB:
Activity Spreadsheet -- Enzyme Inhibition Constant Data from BindingDB
Found 2 hits for monomerid = 222011
TargetCarboxylic ester hydrolase(Equus caballus (Horse))
Tehran University Of Medical Sciences
LigandPNGBDBM222011(N-((1-(4-fluorobenzyl)-1H-1,2,3-triazol-5-yl)methy...)
Affinity DataIC50: >1.00E+5nMpH: 8.0 T: 2°C. Assay description: In vitro anti-AChE activity was performed based on the modified Ellman's method [Ellman et al., Biochem. Pharmacol., 71:88-95]. For this purpose, syn...
Ligand InfoPC cidPC sid
In DepthDetails ArticlePubMed
TargetAcetylcholinesterase(Electrophorus electricus (Electric eel))
Tehran University Of Medical Sciences
LigandPNGBDBM222011(N-((1-(4-fluorobenzyl)-1H-1,2,3-triazol-5-yl)methy...)
Affinity DataIC50: >1.00E+5nMpH: 8.0 T: 2°C. Assay description: In vitro anti-AChE activity was performed based on the modified Ellman's method [Ellman et al., Biochem. Pharmacol., 71:88-95]. For this purpose, syn...
Ligand InfoPC cidPC sid
In DepthDetails ArticlePubMed