BDBM222017 N-((1-(4-bromobenzyl)-1H-1,2,3-triazol-4-yl)methyl)-2-oxo-2H-chromene-3-carboxamide (6k)
SMILES Brc1ccc(Cn2cc(CNC(=O)c3cc4ccccc4oc3=O)nn2)cc1
InChI Key InChIKey=NIXJYHPVAPPMGR-UHFFFAOYSA-N
Data  2 IC50
  Tab Delimited (TSV)   2D SDfile   Computed 3D by Vconf -m prep SDfile
Find this compound or compounds like it in BindingDB:
Activity Spreadsheet -- Enzyme Inhibition Constant Data from BindingDB
Found 2 hits for monomerid = 222017
TargetCarboxylic ester hydrolase(Equus caballus (Horse))
Tehran University Of Medical Sciences
LigandPNGBDBM222017(N-((1-(4-bromobenzyl)-1H-1,2,3-triazol-4-yl)methyl...)
Affinity DataIC50:  7.53E+4nMpH: 8.0 T: 2°C. Assay description: In vitro anti-AChE activity was performed based on the modified Ellman's method [Ellman et al., Biochem. Pharmacol., 71:88-95]. For this purpose, syn...
Ligand InfoPC cidPC sid
In DepthDetails ArticlePubMed
TargetCarboxylic ester hydrolase(Equus caballus (Horse))
Tehran University Of Medical Sciences
LigandPNGBDBM222017(N-((1-(4-bromobenzyl)-1H-1,2,3-triazol-4-yl)methyl...)
Affinity DataIC50: >1.00E+5nMpH: 8.0 T: 2°C. Assay description: In vitro anti-AChE activity was performed based on the modified Ellman's method [Ellman et al., Biochem. Pharmacol., 71:88-95]. For this purpose, syn...
Ligand InfoPC cidPC sid
In DepthDetails ArticlePubMed