BDBM222061 N-(2-chlorophenyl)-2-(4-(5,6-dimethyl-1H-benzo[d]imidazol-2-yl)benzoyl)hydrazinecarbothioamide (2)
SMILES Cc1cc2nc([nH]c2cc1C)-c1ccc(cc1)C(=O)NNC(=S)Nc1ccccc1Cl
InChI Key InChIKey=PASBKCBFAOUHJC-UHFFFAOYSA-N
Data  1 IC50
  Tab Delimited (TSV)   2D SDfile   Computed 3D by Vconf -m prep SDfile
Find this compound or compounds like it in BindingDB:
Activity Spreadsheet -- Enzyme Inhibition Constant Data from BindingDB
Found 1 hit for monomerid = 222061
TargetOligo-1,6-glucosidase IMA1(Saccharomyces cerevisiae S288c (Baker's yeast))
Universiti Teknologi Mara (Uitm)
LigandPNGBDBM222061(N-(2-chlorophenyl)-2-(4-(5,6-dimethyl-1H-benzo[d]i...)
Affinity DataIC50:  2.84E+5nMpH: 6.8 T: 2°C. Assay description: The enzyme inhibition was evaluated according to the method previously reported by Zawawi et al. [Zawawi et al., Bioorg. Chem., 23:3119] with slight ...
Ligand InfoPC cidPC sid
In DepthDetails ArticlePubMed