BDBM222103 (E)-2-(Pyren-1-ylmethylene)hydrazine-1-carbothioamide (2)
SMILES NC(=S)N\N=C\c1ccc2ccc3cccc4ccc1c2c34
InChI Key InChIKey=LWAYWNMXLKHYLA-KEBDBYFISA-N
Data  2 IC50
  Tab Delimited (TSV)   2D SDfile   Computed 3D by Vconf -m prep SDfile
Find this compound or compounds like it in BindingDB:
Activity Spreadsheet -- Enzyme Inhibition Constant Data from BindingDB
Found 2 hits for monomerid = 222103
TargetBeta-glucuronidase(Homo sapiens (Human))
University Of Kwazulu-Natal
Curated by ChEMBL
LigandPNGBDBM222103((E)-2-(Pyren-1-ylmethylene)hydrazine-1-carbothioam...)
Affinity DataIC50:  4.84E+4nM. Assay description: Inhibition of beta-glucuronidase (unknown origin)
Ligand InfoPC cidPC sid
In DepthDetails ArticlePubMed
TargetBeta-glucuronidase(Bos taurus (Bovine))
University Of Karachi
LigandPNGBDBM222103((E)-2-(Pyren-1-ylmethylene)hydrazine-1-carbothioam...)
Affinity DataIC50:  5.50E+3nM. Assay description: β-Glucuronidase inhibitory activity was measured by quantifying the absorbance of para-nitrophenol which was formed from the substrate by the sp...
Ligand InfoPC cidPC sid
In DepthDetails ArticlePubMed