BDBM222155 6,8-dinitro-2,2-bis(2-methylpropyl)-2,3-dihydroquinazolin-4(1H)-one (4h)
SMILES CC(C)CC1(CC(C)C)NC(=O)c2cc(cc(c2N1)[N+]([O-])=O)[N+]([O-])=O
InChI Key InChIKey=ARPLBFLUDRNIQD-UHFFFAOYSA-N
Data  2 IC50
  Tab Delimited (TSV)   2D SDfile   Computed 3D by Vconf -m prep SDfile
Find this compound or compounds like it in BindingDB:
Activity Spreadsheet -- Enzyme Inhibition Constant Data from BindingDB
Found 2 hits for monomerid = 222155
TargetCarboxylic ester hydrolase(Equus caballus (Horse))
University Of Sargodha
LigandPNGBDBM222155(6,8-dinitro-2,2-bis(2-methylpropyl)-2,3-dihydroqui...)
Affinity DataIC50:  5.30E+3nMpH: 8.0Assay Description:Galantamine was used as reference drugs. The synthesized quinazolines were dissolved in 0.1 M phosphate buffer of pH 8.0. (KH2PO4/K2HPO4. The reactio...
Ligand InfoPC cidPC sid
In DepthDetails ArticlePubMed
TargetAcetylcholinesterase(Electrophorus electricus (Electric eel))
University Of Sargodha
LigandPNGBDBM222155(6,8-dinitro-2,2-bis(2-methylpropyl)-2,3-dihydroqui...)
Affinity DataIC50:  3.90E+3nMpH: 8.0Assay Description:Galantamine was used as reference drugs. The synthesized quinazolines were dissolved in 0.1 M phosphate buffer of pH 8.0. (KH2PO4/K2HPO4. The reactio...
Ligand InfoPC cidPC sid
In DepthDetails ArticlePubMed