BDBM222253 N3-Benzylidene-6-iodo-N4-(4-methylthiazol-2-yl)-2-phenylquinazoline-3,4-(4H)-diamine (8f)
SMILES Cc1csc(NC2N(\N=C\c3ccccc3)C(=Nc3ccc(I)cc23)c2ccccc2)n1
InChI Key InChIKey=BZRFOIXWYDQZGY-JFLMPSFJSA-N
Data  1 IC50
  Tab Delimited (TSV)   2D SDfile   Computed 3D by Vconf -m prep SDfile
Find this compound or compounds like it in BindingDB:
Activity Spreadsheet -- Enzyme Inhibition Constant Data from BindingDB
Found 1 hit for monomerid = 222253
TargetDipeptidyl peptidase 4(Homo sapiens (Human))
Jamia Hamdard (Hamdard University)
LigandPNGBDBM222253(N3-Benzylidene-6-iodo-N4-(4-methylthiazol-2-yl)-2-...)
Affinity DataIC50:  7.24nM. Assay description: The synthetic title compounds 7 (a-j) and 8 (a-j) were screened for in vitro DPP-4 inhibition using DPP-4 activity assay kit (Krishgen BioSystems). D...
Ligand InfoPC cidPC sid
In DepthDetails ArticlePubMed