BDBM222267 (Z)-4-(2-((E)-1-morpholino-4-(3-Nitrophenyl)-2-oxobut-3-enylidene)hydrazinyl) benzenesulfonamide (4j)
SMILES NS(=O)(=O)c1ccc(N\N=C(/N2CCOCC2)C(=O)\C=C\c2cccc(c2)[N+]([O-])=O)cc1
InChI Key InChIKey=VWSOCBKOPMQMCH-RKQUYWPKSA-N
Data  1 IC50
  Tab Delimited (TSV)   2D SDfile   Computed 3D by Vconf -m prep SDfile
Find this compound or compounds like it in BindingDB:
Activity Spreadsheet -- Enzyme Inhibition Constant Data from BindingDB
Found 1 hit for monomerid = 222267
TargetIntestinal-type alkaline phosphatase(Bos taurus (Cattle))
Comsats Institute Of Information Technology
LigandPNGBDBM222267((Z)-4-(2-((E)-1-morpholino-4-(3-Nitrophenyl)-2-oxo...)
Affinity DataIC50:  740nMpH: 9.8 T: 2°C. Assay description: Alkaline phosphatase assay was optimized and performed in the same way as previously reported method with slight modifications [Sergienko et al., Nat...
Ligand InfoPC cidPC sid
In DepthDetails ArticlePubMed