BDBM222295 4-(Benzo[d][1,3]dioxol-5-yl)-2-(2-(4-phenylpiperazin-1-yl)-2-oxoethyl)-6-phenylpyridazin-3(2H)-one (13)
SMILES O=C(Cn1nc(cc(-c2ccc3OCOc3c2)c1=O)-c1ccccc1)N1CCN(CC1)c1ccccc1
InChI Key InChIKey=LMQCNYSRXMJDAP-UHFFFAOYSA-N
Data  1 Kd
  Tab Delimited (TSV)   2D SDfile   Computed 3D by Vconf -m prep SDfile
Find this compound or compounds like it in BindingDB:
Activity Spreadsheet -- Enzyme Inhibition Constant Data from BindingDB
Found 1 hit for monomerid = 222295
TargetProstaglandin G/H synthase 2(Homo sapiens (Human))
Panjab University
LigandPNGBDBM222295(4-(Benzo[d][1,3]dioxol-5-yl)-2-(2-(4-phenylpiperaz...)
Affinity DataKd:  3.30nM. Assay description: Inhibitory activity of the synthesized compounds on COX-1 and COX-2 enzymes were evaluated at 40 μm using the COX Inhibitor Screening Assay Kit ...
Ligand InfoPC cidPC sid
In DepthDetails ArticlePubMed