BDBM222362 IPR-1195 (15)
SMILES CC(C)(C)c1ccc(cc1)N1C(C(C(=O)c2ccc(Cl)cc2)=C(O)C1=O)c1cccc(F)c1
InChI Key InChIKey=GTBWBALLDIBLCM-UHFFFAOYSA-N
Data  1 KI  1 IC50
  Tab Delimited (TSV)   2D SDfile   Computed 3D by Vconf -m prep SDfile
Find this compound or compounds like it in BindingDB:
Activity Spreadsheet -- Enzyme Inhibition Constant Data from BindingDB
Found 1 hit for monomerid = 222362
TargetUrokinase plasminogen activator surface receptor(Homo sapiens (Human))
Indiana University School Of Medicine
LigandPNGBDBM222362(IPR-1195 (15))
Affinity DataKi:  1.60E+3nM IC50:  6.17E+4nM. Assay description: Polarized fluorescence intensities were measured using an EnVision Multilabel plate reader (PerkinElmer) with excitation and emission wavelengths of ...
Ligand InfoPC cidPC sid
In DepthDetails ArticlePubMed