BDBM222417 5-(3-methoxybenzoyl)-4-methyl-1,3,4,5-tetrahydro-2H-1,5-benzodiazepin-2-one (A5)
SMILES COc1cccc(c1)C(=O)N1C(C)CC(=O)Nc2ccccc12
InChI Key InChIKey=WQDSULVMDRLQKB-UHFFFAOYSA-N
Data  1 IC50
  Tab Delimited (TSV)   2D SDfile   Computed 3D by Vconf -m prep SDfile
Find this compound or compounds like it in BindingDB:
Activity Spreadsheet -- Enzyme Inhibition Constant Data from BindingDB
Found 1 hit for monomerid = 222417
TargetGag-Pol polyprotein(Human immunodeficiency virus type 1 group M subtyp...)
Birla Institute Of Technology
LigandPNGBDBM222417(5-(3-methoxybenzoyl)-4-methyl-1,3,4,5-tetrahydro-2...)
Affinity DataIC50:  8.79E+4nM. Assay description: The reaction mixture was set with template primer complex, RT enzyme and dNTPs in a lysis buffer with or without inhibitors. The reaction mixture was...
In DepthDetails ArticlePubMed