BDBM222419 5-(2-fluorobenzoyl)-4-methyl-1,3,4,5-tetrahydro-2H-1,5-benzodiazepin-2-one (A7)
SMILES CC1CC(=O)Nc2ccccc2N1C(=O)c1ccccc1F
InChI Key InChIKey=XGYPRDHIWAJGGI-UHFFFAOYSA-N
Data  1 IC50
  Tab Delimited (TSV)   2D SDfile   Computed 3D by Vconf -m prep SDfile
Find this compound or compounds like it in BindingDB:
Activity Spreadsheet -- Enzyme Inhibition Constant Data from BindingDB
Found 1 hit for monomerid = 222419
TargetGag-Pol polyprotein(Human immunodeficiency virus type 1 group M subtyp...)
Birla Institute Of Technology
LigandPNGBDBM222419(5-(2-fluorobenzoyl)-4-methyl-1,3,4,5-tetrahydro-2H...)
Affinity DataIC50: >1.00E+5nM. Assay description: The reaction mixture was set with template primer complex, RT enzyme and dNTPs in a lysis buffer with or without inhibitors. The reaction mixture was...
In DepthDetails ArticlePubMed