BDBM222493 US9315489, 29
SMILES FC(F)(F)Oc1ccc(NC(=O)c2ccc(Cl)c(c2)-c2cc[nH]n2)cc1
InChI Key InChIKey=JKQZZTNEERAJRG-UHFFFAOYSA-N
Data  1 IC50
  Tab Delimited (TSV)   2D SDfile   Computed 3D by Vconf -m prep SDfile
Find this compound or compounds like it in BindingDB:
Activity Spreadsheet -- Enzyme Inhibition Constant Data from BindingDB
Found 1 hit for monomerid = 222493
TargetTyrosine-protein kinase ABL1 [64-515](Homo sapiens (Human))
Novartis
US Patent
LigandPNGBDBM222493(US9315489, 29)
Affinity DataIC50:  4.90nMpH: 7.5 T: 2°C. Assay description: For determination of ABL kinase activity, the radiometric filter-binding assay was used. The assay was performed by mixing 10 μL of the compound p...
Ligand InfoPC cidPC sid
In DepthDetails US Patent