BDBM222509 US9315489, 45
SMILES FC(F)(F)Oc1ccc(NC(=O)c2cnc(C3CCOCC3)c(c2)-c2cncnc2)cc1
InChI Key InChIKey=DMVIJNXPSHAOLR-UHFFFAOYSA-N
Data  1 IC50
  Tab Delimited (TSV)   2D SDfile   Computed 3D by Vconf -m prep SDfile
Find this compound or compounds like it in BindingDB:
Activity Spreadsheet -- Enzyme Inhibition Constant Data from BindingDB
Found 1 hit for monomerid = 222509
TargetTyrosine-protein kinase ABL1 [64-515](Homo sapiens (Human))
Novartis
US Patent
LigandPNGBDBM222509(US9315489, 45)
Affinity DataIC50:  3nMpH: 7.5 T: 2°C. Assay description: For determination of ABL kinase activity, the radiometric filter-binding assay was used. The assay was performed by mixing 10 μL of the compound p...
Ligand InfoPC cidPC sid
In DepthDetails US Patent