BDBM222539 US9315489, 75
SMILES Fc1cncc(c1)-c1cncc(c1)C(=O)Nc1ccc(OC(F)(F)F)cc1
InChI Key InChIKey=HZUSSBYGSRREPT-UHFFFAOYSA-N
Data  1 IC50
  Tab Delimited (TSV)   2D SDfile   Computed 3D by Vconf -m prep SDfile
Find this compound or compounds like it in BindingDB:
Activity Spreadsheet -- Enzyme Inhibition Constant Data from BindingDB
Found 1 hit for monomerid = 222539
TargetTyrosine-protein kinase ABL1 [64-515](Homo sapiens (Human))
Novartis
US Patent
LigandPNGBDBM222539(US9315489, 75)
Affinity DataIC50:  26nMpH: 7.5 T: 2°C. Assay description: All assays were performed in 384-well microtiter plates. Each assay plate contained 8-point serial dilutions for 40 test compounds, as well as four 8...
Ligand InfoPC cidPC sid
In DepthDetails US Patent