BDBM222554 US9315491, MTR-0173::US9801888, Compound MTR-0173
SMILES CSc1c(nc(nc1N1CCN(CC1)S(C)(=O)=O)-c1ccc(NC(=O)Nc2ccccc2)cc1)N1CCOCC1
InChI Key InChIKey=SXTIUXDVYXIOIY-UHFFFAOYSA-N
Data  2 IC50
  Tab Delimited (TSV)   2D SDfile   Computed 3D by Vconf -m prep SDfile
Find this compound or compounds like it in BindingDB:
Activity Spreadsheet -- Enzyme Inhibition Constant Data from BindingDB
Found 2 hits for monomerid = 222554
TargetSerine/threonine-protein kinase mTOR(Homo sapiens (Human))
Development Center For Biotechnology
US Patent
LigandPNGBDBM222554(US9315491, MTR-0173 | US9801888, Compound MTR-0173)
Affinity DataIC50:  198nM. Assay description: The activity of the compound against mTOR was examined by measuring the incorporation of 33P from [γ-33P]-ATP into 4EBP1. His-tagged, recombinan...
Ligand InfoPC cidPC sid
In DepthDetails US Patent
TargetSerine/threonine-protein kinase mTOR(Homo sapiens (Human))
Development Center For Biotechnology
US Patent
LigandPNGBDBM222554(US9315491, MTR-0173 | US9801888, Compound MTR-0173)
Affinity DataIC50:  198nMpH: 7.5Assay Description:The activity of the compound against mTOR was examined by measuring the incorporation of 33P from [γ-33P]-ATP into 4EBP1. His-tagged, recombina...
Ligand InfoPC cidPC sid
In DepthDetails US Patent