BDBM222608 US9315491, MTR-0314::US9801888, Compound MTR-0314
SMILES COc1cnc(nc1N1CCOCC1)-c1ccc(NC(=O)Nc2nccs2)cc1
InChI Key InChIKey=UQFDUBXPPUOZLF-UHFFFAOYSA-N
Data  2 IC50
  Tab Delimited (TSV)   2D SDfile   Computed 3D by Vconf -m prep SDfile
Find this compound or compounds like it in BindingDB:
Activity Spreadsheet -- Enzyme Inhibition Constant Data from BindingDB
Found 2 hits for monomerid = 222608
TargetSerine/threonine-protein kinase mTOR(Homo sapiens (Human))
Development Center For Biotechnology
US Patent
LigandPNGBDBM222608(US9315491, MTR-0314 | US9801888, Compound MTR-0314)
Affinity DataIC50:  170nM. Assay description: The activity of the compound against mTOR was examined by measuring the incorporation of 33P from [γ-33P]-ATP into 4EBP1. His-tagged, recombinan...
Ligand InfoPC cidPC sid
In DepthDetails US Patent
TargetSerine/threonine-protein kinase mTOR(Homo sapiens (Human))
Development Center For Biotechnology
US Patent
LigandPNGBDBM222608(US9315491, MTR-0314 | US9801888, Compound MTR-0314)
Affinity DataIC50:  170nMpH: 7.5Assay Description:The activity of the compound against mTOR was examined by measuring the incorporation of 33P from [γ-33P]-ATP into 4EBP1. His-tagged, recombina...
Ligand InfoPC cidPC sid
In DepthDetails US Patent