BDBM222693 US9315493, 25
SMILES CCCCc1nc(C2CCC2)n(-c2ncc(OCC)cn2)c(=O)c1Cc1ccc(nc1)-c1ccccc1-c1noc(=O)[nH]1
InChI Key InChIKey=HHNGOMCPBBYXST-UHFFFAOYSA-N
Data  1 EC50
  Tab Delimited (TSV)   2D SDfile   Computed 3D by Vconf -m prep SDfile
Find this compound or compounds like it in BindingDB:
Activity Spreadsheet -- Enzyme Inhibition Constant Data from BindingDB
Found 1 hit for monomerid = 222693
LigandPNGBDBM222693(US9315493, 25)
Affinity DataEC50:  820nM. Assay description: As an expression vector, a chimera in which DNA binding domain of Gal4, which is a yeast transcription factor, and ligand binding domain of human PPA...
Ligand InfoPC cidPC sid
In DepthDetails US Patent