BDBM22287 N-[4-(1H-indol-3-yl)butyl]-4-pentylbenzene-1-sulfonamide::indolylbutyl phenylsulfonamide, 27
SMILES CCCCCc1ccc(cc1)S(=O)(=O)NCCCCc1c[nH]c2ccccc12
InChI Key InChIKey=RKYPODCZFCWBLQ-UHFFFAOYSA-N
Data  1 IC50
  Tab Delimited (TSV)   2D SDfile   Computed 3D by Vconf -m prep SDfile
Find this compound or compounds like it in BindingDB:
Activity Spreadsheet -- Enzyme Inhibition Constant Data from BindingDB
Found 1 hit for monomerid = 22287
TargetPolyunsaturated fatty acid lipoxygenase ALOX15(Oryctolagus cuniculus (rabbit))
Bristol-Myers Squibb
LigandPNGBDBM22287(N-[4-(1H-indol-3-yl)butyl]-4-pentylbenzene-1-sulfo...)
Affinity DataIC50:  110nM. Assay description: The inhibitory activity of the compounds against purified 15-LO enzyme was determined using a standard colorimetric assay in which the lipid hydroper...
In DepthDetails ArticlePubMed