BDBM222874 US9315498, 160
SMILES CC1(C)CN(C(=O)C1)c1cnc(cn1)C#Cc1cccc(F)c1
InChI Key InChIKey=SMMOCGCMCMONGA-UHFFFAOYSA-N
Data  1 EC50
  Tab Delimited (TSV)   2D SDfile   Computed 3D by Vconf -m prep SDfile
Find this compound or compounds like it in BindingDB:
Activity Spreadsheet -- Enzyme Inhibition Constant Data from BindingDB
Found 1 hit for monomerid = 222874
TargetIsoform 1 of Metabotropic glutamate receptor 5 (5a)(Homo sapiens (Human))
Hoffmann-La Roche
US Patent
LigandPNGBDBM222874(US9315498, 160)
Affinity DataEC50:  29nMT: 2°C. Assay description: A monoclonal HEK-293 cell line stably transfected with a cDNA encoding for the human mGlu5a receptor was generated; for the work with mGlu5 Positive ...
Ligand InfoPC cidPC sid
In DepthDetails US Patent