BDBM223147 Methyl-cis-4-(4-(2-(ethyl(m-tolyl)amino)-2-oxoethyl)-4H-thieno[3,2-b]pyrrole-5carboxamido)cyclohexane-1-carboxylate (9)
SMILES CCN(C(=O)Cn1c(cc2sccc12)C(=O)N[C@H]1CC[C@H](CC1)C(=O)OC)c1cccc(C)c1
InChI Key InChIKey=UYCXONSXRYAHJI-KDURUIRLSA-N
Data  1 IC50
  Tab Delimited (TSV)   2D SDfile   Computed 3D by Vconf -m prep SDfile
Find this compound or compounds like it in BindingDB:
Activity Spreadsheet -- Enzyme Inhibition Constant Data from BindingDB
Found 1 hit for monomerid = 223147
TargetOplophorus-luciferin 2-monooxygenase catalytic subunit(Oplophorus gracilirostris (Luminous shrimp))
Promega Biosciences
LigandPNGBDBM223147(Methyl-cis-4-(4-(2-(ethyl(m-tolyl)amino)-2-oxoethy...)
Affinity DataIC50:  230nM. Assay description: NanoLuc enzyme was diluted to 0.4 ng/mL in CO2 independent media + 10% FBS to make the detection reagent. A 3× dilution series of each inhibitor was ...
Ligand InfoPC cidPC sid
In DepthDetails ArticlePubMed