BDBM223154 N-cyclohexyl-4-(2-(hexyl(m-tolyl)amino)-2-oxoethyl)-4H-thieno[3,2-b]pyrrole-5-carboxamide (16)
SMILES CCCCCCN(C(=O)Cn1c(cc2sccc12)C(=O)NC1CCCCC1)c1cccc(C)c1
InChI Key InChIKey=JJBVYAOWNSLQIN-UHFFFAOYSA-N
Data  1 IC50
  Tab Delimited (TSV)   2D SDfile   Computed 3D by Vconf -m prep SDfile
Find this compound or compounds like it in BindingDB:
Activity Spreadsheet -- Enzyme Inhibition Constant Data from BindingDB
Found 1 hit for monomerid = 223154
TargetOplophorus-luciferin 2-monooxygenase catalytic subunit(Oplophorus gracilirostris (Luminous shrimp))
Promega Biosciences
LigandPNGBDBM223154(N-cyclohexyl-4-(2-(hexyl(m-tolyl)amino)-2-oxoethyl...)
Affinity DataIC50:  5.60E+3nM. Assay description: NanoLuc enzyme was diluted to 0.4 ng/mL in CO2 independent media + 10% FBS to make the detection reagent. A 3× dilution series of each inhibitor was ...
Ligand InfoPC cidPC sid
In DepthDetails ArticlePubMed