BDBM223176 4-(2-(Ethyl(m-tolyl)amino)-2-oxoethyl)-N-(trans-4-(hexylcarbamoyl)cyclohexyl)-4H-thieno[3,2b]pyrrole-5-carboxamide (38)
SMILES CCCCCCNC(=O)C1CCC(CC1)NC(=O)c1cc2sccc2n1CC(=O)N(CC)c1cccc(C)c1
InChI Key InChIKey=VADUSULEVYTMJJ-UHFFFAOYSA-N
Data  1 IC50
  Tab Delimited (TSV)   2D SDfile   Computed 3D by Vconf -m prep SDfile
Find this compound or compounds like it in BindingDB:
Activity Spreadsheet -- Enzyme Inhibition Constant Data from BindingDB
Found 1 hit for monomerid = 223176
TargetOplophorus-luciferin 2-monooxygenase catalytic subunit(Oplophorus gracilirostris (Luminous shrimp))
Promega Biosciences
LigandPNGBDBM223176(4-(2-(Ethyl(m-tolyl)amino)-2-oxoethyl)-N-(trans-4-...)
Affinity DataIC50:  160nM. Assay description: NanoLuc enzyme was diluted to 0.4 ng/mL in CO2 independent media + 10% FBS to make the detection reagent. A 3× dilution series of each inhibitor was ...
Ligand InfoPC cidPC sid
In DepthDetails ArticlePubMed