BDBM223228 2-(5-((4-Chlorophenyl)((1-(trifluoromethyl)cyclopropyl)methyl)amino)-3-methoxypicolinoyl)cyclopropanecarboxylic acid::US20160326143, 3
SMILES COc1cc(cnc1C(=O)C1CC1C(O)=O)N(C(C1CC1)C(F)(F)F)c1ccc(Cl)cc1
InChI Key InChIKey=LWAUMGSKFOFDCB-UHFFFAOYSA-N
Data  1 IC50
  Tab Delimited (TSV)   2D SDfile   Computed 3D by Vconf -m prep SDfile
Find this compound or compounds like it in BindingDB:
Activity Spreadsheet -- Enzyme Inhibition Constant Data from BindingDB
Found 1 hit for monomerid = 223228
TargetLeukotriene C4 synthase(Homo sapiens (Human))
Astrazeneca
US Patent
LigandPNGBDBM223228(2-(5-((4-Chlorophenyl)((1-(trifluoromethyl)cyclopr...)
Affinity DataIC50:  149nMpH: 7.8Assay Description:In the assay, LTC4 synthase catalyses the reaction where the substrate LTA4 is converted to LTC4. Recombinant human LTC4 synthase is expressed in Pic...
Ligand InfoPC cidPC sid
In DepthDetails US Patent