BDBM223285 (2-(1H-Tetrazol-5-yl)cyclopropyl)(5-((cyclopropylmethyl)(naphthalen-1-yl)amino)-3-methoxypyridin-2-yl)methanone::US20160326143, 60::US9657001, 60
SMILES COc1cc(cnc1C(=O)C1CC1c1nnn[nH]1)N(CC1CC1)c1cccc2ccccc12
InChI Key
Data  2 IC50
  Tab Delimited (TSV)   2D SDfile   Computed 3D by Vconf -m prep SDfile
Find this compound or compounds like it in BindingDB:
Activity Spreadsheet -- Enzyme Inhibition Constant Data from BindingDB
Found 2 hits for monomerid = 223285
TargetLeukotriene C4 synthase(Homo sapiens (Human))
Astrazeneca
US Patent
LigandPNGBDBM223285((2-(1H-Tetrazol-5-yl)cyclopropyl)(5-((cyclopropylm...)
Affinity DataIC50:  96nM. Assay description: In the assay, LTC4 synthase catalyses the reaction where the substrate LTA4 methyl ester is converted to LTC4 methyl ester.In order to obtain IC50-va...
Ligand InfoPC cidPC sid
In DepthDetails US Patent
TargetLeukotriene C4 synthase(Homo sapiens (Human))
Astrazeneca
US Patent
LigandPNGBDBM223285((2-(1H-Tetrazol-5-yl)cyclopropyl)(5-((cyclopropylm...)
Affinity DataIC50:  96nMpH: 7.8Assay Description:In the assay, LTC4 synthase catalyses the reaction where the substrate LTA4 is converted to LTC4. Recombinant human LTC4 synthase is expressed in Pic...
Ligand InfoPC cidPC sid
In DepthDetails US Patent