BDBM223424 US9315520, 67
SMILES C[C@H]1C[C@H]2CSC(N)=NC2(CO1)c1nc(NC(=O)c2cc(C)no2)cs1
InChI Key InChIKey=GBCMWKCOVLVKAA-VLVWQGGMSA-N
Data  1 IC50
  Tab Delimited (TSV)   2D SDfile   Computed 3D by Vconf -m prep SDfile
Find this compound or compounds like it in BindingDB:
Activity Spreadsheet -- Enzyme Inhibition Constant Data from BindingDB
Found 1 hit for monomerid = 223424
TargetIsoform D of Beta-secretase 1 (BACE-I-432)(Homo sapiens (Human))
Pfizer
US Patent
LigandPNGBDBM223424(US9315520, 67)
Affinity DataIC50:  5.04E+3nMpH: 4.5 T: 2°C. Assay description: The substrate is Biotin-GLTNIKTEEISEISY^EVEFR-C[Oregon Green]KK-OH. The BACE1 enzyme is affinity purified material from conditioned media of CHO-K1 c...
Ligand InfoPC cidPC sid
In DepthDetails US Patent