BDBM22345 1,3-Diarylprop-2-yn-1-one, 13b::3-(4-methanesulfonylphenyl)-1-(4-methylphenyl)prop-2-yn-1-one::CHEMBL194897
SMILES Cc1ccc(cc1)C(=O)C#Cc1ccc(cc1)S(C)(=O)=O
InChI Key InChIKey=MVEXLQMDJOVCFZ-UHFFFAOYSA-N
Data  8 IC50
  Tab Delimited (TSV)   2D SDfile   Computed 3D by Vconf -m prep SDfile
Find this compound or compounds like it in BindingDB:
Activity Spreadsheet -- Enzyme Inhibition Constant Data from BindingDB
Found 8 hits for monomerid = 22345
TargetProstaglandin G/H synthase 1(Ovis aries (Sheep))
University Of Alberta
LigandPNGBDBM22345(1,3-Diarylprop-2-yn-1-one, 13b | 3-(4-methanesulfo...)
Affinity DataIC50: >1.00E+5nMpH: 8.0 T: 2°C. Assay description: The COX enzyme activities were measured using the COX Inhibitor Screening Assay kit provided by Cayman (Cayman, Chemical Co., Ann Arbor, MI). The as...
In DepthDetails ArticlePubMed
TargetProstaglandin G/H synthase 2(Homo sapiens (Human))
University Of Alberta
LigandPNGBDBM22345(1,3-Diarylprop-2-yn-1-one, 13b | 3-(4-methanesulfo...)
Affinity DataIC50:  3.30E+4nM. Assay description: The COX enzyme activities were measured using the COX Inhibitor Screening Assay kit provided by Cayman (Cayman, Chemical Co., Ann Arbor, MI). The as...
In DepthDetails ArticlePubMed
TargetLipoxygenase(Solanum tuberosum (potato))
University Of Alberta
LigandPNGBDBM22345(1,3-Diarylprop-2-yn-1-one, 13b | 3-(4-methanesulfo...)
Affinity DataIC50: >1.00E+4nM. Assay description: The lipoxygenase inhibitor screening assay detects and measures the hydroperoxides produced in the lipoxygenation reaction using a purified lipoxygen...
In DepthDetails ArticlePubMed
TargetProstaglandin G/H synthase 2(Ovis aries (Sheep))
University Of Alberta
Curated by ChEMBL
LigandPNGBDBM22345(1,3-Diarylprop-2-yn-1-one, 13b | 3-(4-methanesulfo...)
Affinity DataIC50:  3.30E+4nM. Assay description: In vitro inhibitory activity against ovine cyclooxygenase 2
In DepthDetails ArticlePubMed
TargetProstaglandin G/H synthase 1(Ovis aries (Sheep))
University Of Alberta
LigandPNGBDBM22345(1,3-Diarylprop-2-yn-1-one, 13b | 3-(4-methanesulfo...)
Affinity DataIC50: >1.00E+5nM. Assay description: In vitro inhibitory activity against ovine cyclooxygenase 1
In DepthDetails ArticlePubMed
TargetSeed linoleate 13S-lipoxygenase-1(Glycine max (soybean))
University Of Alberta
Curated by ChEMBL
LigandPNGBDBM22345(1,3-Diarylprop-2-yn-1-one, 13b | 3-(4-methanesulfo...)
Affinity DataIC50: >1.00E+4nM. Assay description: In vitro inhibitory activity against 5-lipoxygenase obtained from potato
In DepthDetails ArticlePubMed
TargetSeed linoleate 13S-lipoxygenase-1(Glycine max (soybean))
University Of Alberta
Curated by ChEMBL
LigandPNGBDBM22345(1,3-Diarylprop-2-yn-1-one, 13b | 3-(4-methanesulfo...)
Affinity DataIC50: >1.00E+4nM. Assay description: In vitro inhibitory activity against 15-lipoxygenase obtained from soybean
In DepthDetails ArticlePubMed
TargetSeed linoleate 13S-lipoxygenase-1(Glycine max (soybean))
University Of Alberta
Curated by ChEMBL
LigandPNGBDBM22345(1,3-Diarylprop-2-yn-1-one, 13b | 3-(4-methanesulfo...)
Affinity DataIC50: >1.00E+4nM. Assay description: The lipoxygenase inhibitor screening assay detects and measures the hydroperoxides produced in the lipoxygenation reaction using a purified lipoxygen...
In DepthDetails ArticlePubMed