BDBM223462 US9320722, CD11
SMILES OC(NC(=O)c1cccnc1)C(=O)c1cccs1
InChI Key InChIKey=MRNUTPVBBSSLER-UHFFFAOYSA-N
Data  3 IC50
  Tab Delimited (TSV)   2D SDfile   Computed 3D by Vconf -m prep SDfile
Find this compound or compounds like it in BindingDB:
Activity Spreadsheet -- Enzyme Inhibition Constant Data from BindingDB
Found 3 hits for monomerid = 223462
TargetAldehyde dehydrogenase 1A1(Homo sapiens (Human))
Indiana University Research And Technology
US Patent
LigandPNGBDBM223462(US9320722, CD11)
Affinity DataIC50:  5.90E+3nMpH: 7.5Assay Description:IC50 values were determined for CB29 and its analogs using propionaldehyde as the substrate for ALDH1A1 and ALDH2 or benzaldehyde as the substrate fo...
In DepthDetails US Patent
TargetAldehyde dehydrogenase, dimeric NADP-preferring(Homo sapiens (Human))
Indiana University Research And Technology
US Patent
LigandPNGBDBM223462(US9320722, CD11)
Affinity DataIC50:  1.02E+4nMpH: 7.5Assay Description:IC50 values were determined for CB29 and its analogs using propionaldehyde as the substrate for ALDH1A1 and ALDH2 or benzaldehyde as the substrate fo...
In DepthDetails US Patent
TargetAldehyde dehydrogenase, mitochondrial(Homo sapiens (Human))
Indiana University Research And Technology
US Patent
LigandPNGBDBM223462(US9320722, CD11)
Affinity DataIC50:  6.50E+3nMpH: 7.5Assay Description:IC50 values were determined for CB29 and its analogs using propionaldehyde as the substrate for ALDH1A1 and ALDH2 or benzaldehyde as the substrate fo...
In DepthDetails US Patent