BDBM223535 US9321743, URB788
SMILES O=C(N[C@H]1CNC1=O)OCc1ccccc1
InChI Key InChIKey=NQXRQYKIEKLAHI-VIFPVBQESA-N
Data  1 IC50
  Tab Delimited (TSV)   2D SDfile   Computed 3D by Vconf -m prep SDfile
Find this compound or compounds like it in BindingDB:
Activity Spreadsheet -- Enzyme Inhibition Constant Data from BindingDB
Found 1 hit for monomerid = 223535
TargetN-acylethanolamine-hydrolyzing acid amidase(Rattus norvegicus (Rat))
University Of California
US Patent
LigandPNGBDBM223535(US9321743, URB788)
Affinity DataIC50:  1.60E+4nMpH: 5.0 T: 2°C. Assay description: Recombinant NAAA or native rat lung NAAA was incubated at 37 °C. for 30 min in 0.2 ml of sodium hydrogen phosphate buffer (50 mM, pH 5.0) contain...
In DepthDetails US Patent