BDBM223804 US9328112, 26
SMILES CN1Cc2c([nH]c3nccc(-c4cc(F)ccc14)c23)C1CCN(CC(=O)N2CCC[C@H]2CO)CC1
InChI Key InChIKey=LIBNIRJBYKYJMU-IBGZPJMESA-N
Data  1 IC50
  Tab Delimited (TSV)   2D SDfile   Computed 3D by Vconf -m prep SDfile
Find this compound or compounds like it in BindingDB:
Activity Spreadsheet -- Enzyme Inhibition Constant Data from BindingDB
Found 1 hit for monomerid = 223804
TargetCyclin-T1/Cyclin-dependent kinase 9(Homo sapiens (Human))
Abbvie
US Patent
LigandPNGBDBM223804(US9328112, 26)
Affinity DataIC50:  93nM. Assay description: CDK9 enzyme activities were measured using LANCE ULight TR-FRET kinase assay reagents (PerkinElmer, Waltham, Mass.). Compounds were diluted in 100% D...
Ligand InfoPC cidPC sid
In DepthDetails US Patent