BDBM223869 US9328112, 91
SMILES CN1Cc2c([nH]c3nccc(-c4cc(F)ccc14)c23)C1=CCCN(CC(=O)N2CC(O)C2)CC1
InChI Key InChIKey=KFGMMTWPUPBJKX-UHFFFAOYSA-N
Data  1 IC50
  Tab Delimited (TSV)   2D SDfile   Computed 3D by Vconf -m prep SDfile
Find this compound or compounds like it in BindingDB:
Activity Spreadsheet -- Enzyme Inhibition Constant Data from BindingDB
Found 1 hit for monomerid = 223869
TargetCyclin-T1/Cyclin-dependent kinase 9(Homo sapiens (Human))
Abbvie
US Patent
LigandPNGBDBM223869(US9328112, 91)
Affinity DataIC50:  180nM. Assay description: CDK9 enzyme activities were measured using LANCE ULight TR-FRET kinase assay reagents (PerkinElmer, Waltham, Mass.). Compounds were diluted in 100% D...
Ligand InfoPC cidPC sid
In DepthDetails US Patent