BDBM223920 US9328112, 142
SMILES CC[C@@H]1N(C)c2ccc(F)cc2-c2ccnc3[nH]c(c1c23)C1=CCNCC1
InChI Key InChIKey=WWCGHYOUUXBXGW-KRWDZBQOSA-N
Data  1 IC50
  Tab Delimited (TSV)   2D SDfile   Computed 3D by Vconf -m prep SDfile
Find this compound or compounds like it in BindingDB:
Activity Spreadsheet -- Enzyme Inhibition Constant Data from BindingDB
Found 1 hit for monomerid = 223920
TargetCyclin-T1/Cyclin-dependent kinase 9(Homo sapiens (Human))
Abbvie
US Patent
LigandPNGBDBM223920(US9328112, 142)
Affinity DataIC50:  30nM. Assay description: CDK9 enzyme activities were measured using LANCE ULight TR-FRET kinase assay reagents (PerkinElmer, Waltham, Mass.). Compounds were diluted in 100% D...
Ligand InfoPC cidPC sid
In DepthDetails US Patent