BDBM223951 US9328112, 173
SMILES CN1Cc2c([nH]c3nccc(-c4cc(F)ccc14)c23)C1=CCN(CC1)C1CCC(CC1)=CC#N
InChI Key InChIKey=WZMWZPOQBRNKPT-LSCVHKIXSA-N
Data  1 IC50
  Tab Delimited (TSV)   2D SDfile   Computed 3D by Vconf -m prep SDfile
Find this compound or compounds like it in BindingDB:
Activity Spreadsheet -- Enzyme Inhibition Constant Data from BindingDB
Found 1 hit for monomerid = 223951
TargetCyclin-T1/Cyclin-dependent kinase 9(Homo sapiens (Human))
Abbvie
US Patent
LigandPNGBDBM223951(US9328112, 173)
Affinity DataIC50:  45nM. Assay description: CDK9 enzyme activities were measured using LANCE ULight TR-FRET kinase assay reagents (PerkinElmer, Waltham, Mass.). Compounds were diluted in 100% D...
Ligand InfoPC cidPC sid
In DepthDetails US Patent