BDBM224000 N-[(1S)-2-[1-(4-Benzoylphenyl)-1,2,3-triazol-4-yl]-1-{[2-(4-sulfamoylphenyl)ethyl]carbamoyl}ethyl]-4,7,10,13,16-pentaoxanonadec-18-ynamide (7)
SMILES NS(=O)(=O)c1ccc(CCNC(=O)[C@H](Cc2cn(nn2)-c2ccc(cc2)C(=O)c2ccccc2)NC(=O)CCOCCOCCOCCOCCOCC#C)cc1
InChI Key InChIKey=RLEUTEUVKDZJRY-QNGWXLTQSA-N
Data  1 IC50
  Tab Delimited (TSV)   2D SDfile   Computed 3D by Vconf -m prep SDfile
Find this compound or compounds like it in BindingDB:
Activity Spreadsheet -- Enzyme Inhibition Constant Data from BindingDB
Found 1 hit for monomerid = 224000
TargetCarbonic anhydrase 2(Homo sapiens (Human))
Griffith University
LigandPNGBDBM224000(N-[(1S)-2-[1-(4-Benzoylphenyl)-1,2,3-triazol-4-yl]...)
Affinity DataIC50:  604nMpH: 7.0 T: 2°C. Assay description: The assay was performed according to a previously reported protocol.[Banerjee et al., Biochemistry, 44:3673-3682] DNSA stock solution was prepared at...
Ligand InfoPC cidPC sid
In DepthDetails ArticlePubMed