BDBM224339 US10080750, Compound 16::US9321760, 16::US9662330, Compound 16
SMILES CN(C)C[C@@H](N1CCN(CC1)c1ncnc(N)c1-c1ccc(F)cc1)c1ccc(cc1)C(F)(F)F
InChI Key InChIKey=HYXXLNCSACYDRW-OAQYLSRUSA-N
Data  3 IC50
  Tab Delimited (TSV)   2D SDfile   Computed 3D by Vconf -m prep SDfile
Find this compound or compounds like it in BindingDB:
Activity Spreadsheet -- Enzyme Inhibition Constant Data from BindingDB
Found 3 hits for monomerid = 224339
TargetRibosomal protein S6 kinase beta-1(Homo sapiens (Human))
Merck Patent
US Patent
LigandPNGBDBM224339(US10080750, Compound 16 | US9321760, 16 | US966233...)
Affinity DataIC50:  4.90nMpH: 7.5Assay Description:P70S6K inhibitor compounds were diluted and plated in 96 well plates. A reaction mixture including the following components was then added to the com...
Ligand InfoPC cidPC sid
In DepthDetails US Patent
TargetRibosomal protein S6 kinase beta-1(Homo sapiens (Human))
Merck Patent
US Patent
LigandPNGBDBM224339(US10080750, Compound 16 | US9321760, 16 | US966233...)
Affinity DataIC50:  4.90nM. Assay description: P70S6K inhibitor compounds were diluted and plated in 96 well plates. A reaction mixture including the following components was then added to the com...
Ligand InfoPC cidPC sid
In DepthDetails US Patent
TargetRibosomal protein S6 kinase beta-1 [T412E](Homo sapiens (Human))
Merck Patent
US Patent
LigandPNGBDBM224339(US10080750, Compound 16 | US9321760, 16 | US966233...)
Affinity DataIC50:  4.90nMpH: 7.5Assay Description:P70S6K inhibitor compounds were diluted and plated in 96 well plates. A reaction mixture including the following components was then added to the com...
Ligand InfoPC cidPC sid
In DepthDetails US Patent