BDBM224350 US10080750, Compound 27::US9321760, 27::US9662330, Compound 27
SMILES Nc1ncnc(N2CCN(CC2)C(CN2CCC2)c2ccc(cc2)C(F)(F)F)c1-c1ccc(F)cc1
InChI Key InChIKey=XVXGWZNJKSPVAQ-UHFFFAOYSA-N
Data  4 IC50
  Tab Delimited (TSV)   2D SDfile   Computed 3D by Vconf -m prep SDfile
Find this compound or compounds like it in BindingDB:
Activity Spreadsheet -- Enzyme Inhibition Constant Data from BindingDB
Found 4 hits for monomerid = 224350
TargetRibosomal protein S6 kinase beta-1(Homo sapiens (Human))
Merck Patent
US Patent
LigandPNGBDBM224350(US10080750, Compound 27 | US9321760, 27 | US966233...)
Affinity DataIC50:  4.20nMpH: 7.5Assay Description:P70S6K inhibitor compounds were diluted and plated in 96 well plates. A reaction mixture including the following components was then added to the com...
Ligand InfoPC cidPC sid
In DepthDetails US Patent
TargetRAC-alpha/RAC-beta/RAC-gamma serine/threonine-protein kinase(Homo sapiens (Human))
Emd Serono Research And Development Institute
Curated by ChEMBL
LigandPNGBDBM224350(US10080750, Compound 27 | US9321760, 27 | US966233...)
Affinity DataIC50: >1.00E+3nM. Assay description: Inhibition of Akt (unknown origin)
Ligand InfoPC cidPC sid
In DepthDetails ArticlePubMed
TargetRibosomal protein S6 kinase beta-1(Homo sapiens (Human))
Merck Patent
US Patent
LigandPNGBDBM224350(US10080750, Compound 27 | US9321760, 27 | US966233...)
Affinity DataIC50:  4.20nM. Assay description: P70S6K inhibitor compounds were diluted and plated in 96 well plates. A reaction mixture including the following components was then added to the com...
Ligand InfoPC cidPC sid
In DepthDetails US Patent
TargetRibosomal protein S6 kinase beta-1 [T412E](Homo sapiens (Human))
Merck Patent
US Patent
LigandPNGBDBM224350(US10080750, Compound 27 | US9321760, 27 | US966233...)
Affinity DataIC50:  4.20nMpH: 7.5Assay Description:P70S6K inhibitor compounds were diluted and plated in 96 well plates. A reaction mixture including the following components was then added to the com...
Ligand InfoPC cidPC sid
In DepthDetails US Patent