BDBM224377 US10080750, Compound 54::US9321760, 54::US9662330, Compound 54
SMILES NC[C@H](C1CCN(CC1)c1ncnc(N)c1-c1ccc(F)cc1)c1ccc(cc1)C(F)(F)F
InChI Key InChIKey=NEIPIANQJOZZOB-FQEVSTJZSA-N
Data  3 IC50
  Tab Delimited (TSV)   2D SDfile   Computed 3D by Vconf -m prep SDfile
Find this compound or compounds like it in BindingDB:
Activity Spreadsheet -- Enzyme Inhibition Constant Data from BindingDB
Found 3 hits for monomerid = 224377
TargetRibosomal protein S6 kinase beta-1(Homo sapiens (Human))
Merck Patent
US Patent
LigandPNGBDBM224377(US10080750, Compound 54 | US9321760, 54 | US966233...)
Affinity DataIC50:  4.5nMpH: 7.5Assay Description:P70S6K inhibitor compounds were diluted and plated in 96 well plates. A reaction mixture including the following components was then added to the com...
Ligand InfoPC cidPC sid
In DepthDetails US Patent
TargetRibosomal protein S6 kinase beta-1(Homo sapiens (Human))
Merck Patent
US Patent
LigandPNGBDBM224377(US10080750, Compound 54 | US9321760, 54 | US966233...)
Affinity DataIC50:  4.5nM. Assay description: P70S6K inhibitor compounds were diluted and plated in 96 well plates. A reaction mixture including the following components was then added to the com...
Ligand InfoPC cidPC sid
In DepthDetails US Patent
TargetRibosomal protein S6 kinase beta-1 [T412E](Homo sapiens (Human))
Merck Patent
US Patent
LigandPNGBDBM224377(US10080750, Compound 54 | US9321760, 54 | US966233...)
Affinity DataIC50:  4.5nMpH: 7.5Assay Description:P70S6K inhibitor compounds were diluted and plated in 96 well plates. A reaction mixture including the following components was then added to the com...
Ligand InfoPC cidPC sid
In DepthDetails US Patent