BDBM224549 US10080750, Compound 232::US9321760, 232::US9662330, Compound 232
SMILES Cc1ccc(cc1)[C@H](CCO)NC(=O)C1(N)CCN(CC1)c1ncnc(N)c1C(N)=O
InChI Key InChIKey=TXTCNUJOUWXVDT-HNNXBMFYSA-N
Data  3 IC50
  Tab Delimited (TSV)   2D SDfile   Computed 3D by Vconf -m prep SDfile
Find this compound or compounds like it in BindingDB:
Activity Spreadsheet -- Enzyme Inhibition Constant Data from BindingDB
Found 3 hits for monomerid = 224549
TargetRibosomal protein S6 kinase beta-1(Homo sapiens (Human))
Merck Patent
US Patent
LigandPNGBDBM224549(US10080750, Compound 232 | US9321760, 232 | US9662...)
Affinity DataIC50:  2.30E+4nMpH: 7.5Assay Description:P70S6K inhibitor compounds were diluted and plated in 96 well plates. A reaction mixture including the following components was then added to the com...
Ligand InfoPC cidPC sid
In DepthDetails US Patent
TargetRibosomal protein S6 kinase beta-1(Homo sapiens (Human))
Merck Patent
US Patent
LigandPNGBDBM224549(US10080750, Compound 232 | US9321760, 232 | US9662...)
Affinity DataIC50:  2.30E+4nM. Assay description: P70S6K inhibitor compounds were diluted and plated in 96 well plates. A reaction mixture including the following components was then added to the com...
Ligand InfoPC cidPC sid
In DepthDetails US Patent
TargetRibosomal protein S6 kinase beta-1 [T412E](Homo sapiens (Human))
Merck Patent
US Patent
LigandPNGBDBM224549(US10080750, Compound 232 | US9321760, 232 | US9662...)
Affinity DataIC50:  2.30E+4nMpH: 7.5Assay Description:P70S6K inhibitor compounds were diluted and plated in 96 well plates. A reaction mixture including the following components was then added to the com...
Ligand InfoPC cidPC sid
In DepthDetails US Patent