BDBM224560 US10080750, Compound 243::US9321760, 243::US9662330, Compound 243
SMILES Nc1ncnc(N2CCC(N)(CC2)C(=O)N[C@@H](CCO)c2ccc(F)cc2)c1C#N
InChI Key InChIKey=DSYDIHUIGRVSDR-INIZCTEOSA-N
Data  3 IC50
  Tab Delimited (TSV)   2D SDfile   Computed 3D by Vconf -m prep SDfile
Find this compound or compounds like it in BindingDB:
Activity Spreadsheet -- Enzyme Inhibition Constant Data from BindingDB
Found 3 hits for monomerid = 224560
TargetRibosomal protein S6 kinase beta-1(Homo sapiens (Human))
Merck Patent
US Patent
LigandPNGBDBM224560(US10080750, Compound 243 | US9321760, 243 | US9662...)
Affinity DataIC50:  390nMpH: 7.5Assay Description:P70S6K inhibitor compounds were diluted and plated in 96 well plates. A reaction mixture including the following components was then added to the com...
Ligand InfoPC cidPC sid
In DepthDetails US Patent
TargetRibosomal protein S6 kinase beta-1(Homo sapiens (Human))
Merck Patent
US Patent
LigandPNGBDBM224560(US10080750, Compound 243 | US9321760, 243 | US9662...)
Affinity DataIC50:  390nM. Assay description: P70S6K inhibitor compounds were diluted and plated in 96 well plates. A reaction mixture including the following components was then added to the com...
Ligand InfoPC cidPC sid
In DepthDetails US Patent
TargetRibosomal protein S6 kinase beta-1 [T412E](Homo sapiens (Human))
Merck Patent
US Patent
LigandPNGBDBM224560(US10080750, Compound 243 | US9321760, 243 | US9662...)
Affinity DataIC50:  390nMpH: 7.5Assay Description:P70S6K inhibitor compounds were diluted and plated in 96 well plates. A reaction mixture including the following components was then added to the com...
Ligand InfoPC cidPC sid
In DepthDetails US Patent