BDBM224592 US10202383, Example 2(129)::US9321791, 2(129)::US9556175, 2(129)
SMILES CC#CCn1c(nc2n(C)c(=O)n(Cc3nc(C)cc4ccccc34)c(=O)c12)N1CCC[C@H](N)C1
InChI Key InChIKey=DFWUAFCLJJBUNR-IBGZPJMESA-N
Data  3 IC50
  Tab Delimited (TSV)   2D SDfile   Computed 3D by Vconf -m prep SDfile
Find this compound or compounds like it in BindingDB:
Activity Spreadsheet -- Enzyme Inhibition Constant Data from BindingDB
Found 3 hits for monomerid = 224592
TargetDipeptidyl peptidase 4(Homo sapiens (Human))
Boehringer Ingelheim International
US Patent
LigandPNGBDBM224592(US10202383, Example 2(129) | US9321791, 2(129) | U...)
Affinity DataIC50:  3nMpH: 7.8Assay Description:50 μl substrate solution (AFC; AFC is amido-4-trifluoromethylcoumarin), final concentration 100 μM, were placed in black microtitre plates. 20 ...
Ligand InfoPC cidPC sid
In DepthDetails US Patent
TargetDipeptidyl peptidase 4(Homo sapiens (Human))
Boehringer Ingelheim International
US Patent
LigandPNGBDBM224592(US10202383, Example 2(129) | US9321791, 2(129) | U...)
Affinity DataIC50:  3nM. Assay description: 50 μl substrate solution (AFC; AFC is amido-4-trifluoromethylcoumarin), final concentration 100 μM, were placed in black microtitre plates....
Ligand InfoPC cidPC sid
In DepthDetails US Patent
TargetDipeptidyl peptidase 4(Homo sapiens (Human))
Boehringer Ingelheim International
US Patent
LigandPNGBDBM224592(US10202383, Example 2(129) | US9321791, 2(129) | U...)
Affinity DataIC50:  3nMpH: 7.8Assay Description:50 μl substrate solution (AFC; AFC is amido-4-trifluoromethylcoumarin), final concentration 100 μM, were placed in black microtitre plates....
Ligand InfoPC cidPC sid
In DepthDetails US Patent