BDBM22493 3-(4-butoxyphenyl)-3-(2-hydroxyphenyl)propanoic acid::3-Aryl-3-(4-phenoxy)-propionic Acid derivative, 52
SMILES CCCCOc1ccc(cc1)C(CC(O)=O)c1ccccc1O
InChI Key InChIKey=SMDGTPHUTBNHBY-UHFFFAOYSA-N
Data  1 EC50
  Tab Delimited (TSV)   2D SDfile   Computed 3D by Vconf -m prep SDfile
Find this compound or compounds like it in BindingDB:
Activity Spreadsheet -- Enzyme Inhibition Constant Data from BindingDB
Found 1 hit for monomerid = 22493
TargetFree fatty acid receptor 1(Homo sapiens (Human))
Johnson & Johnson Pharmaceutical
LigandPNGBDBM22493(3-(4-butoxyphenyl)-3-(2-hydroxyphenyl)propanoic ac...)
Affinity DataEC50:  4.80E+3nMT: 2°C. Assay description:  Human embryonic kidney (HEK293) cells expressing human GPR40 receptors were grown in Dulbecco modified Eagles medium (DMEM)/F12 media supplemented w...
In DepthDetails ArticlePubMed