BDBM225107 US9328118, 3
SMILES CN(C)C(=O)CN1CCC(CCOc2ccc(cc2C(F)(F)F)-c2nc(nc3n(C)ccc23)C#N)CC1
InChI Key InChIKey=DHGQYFCNNXGBKO-UHFFFAOYSA-N
Data  2 IC50
  Tab Delimited (TSV)   2D SDfile   Computed 3D by Vconf -m prep SDfile
Find this compound or compounds like it in BindingDB:
Activity Spreadsheet -- Enzyme Inhibition Constant Data from BindingDB
Found 2 hits for monomerid = 225107
TargetCathepsin S(Mus musculus (Mouse))
Astellas Pharma
US Patent
LigandPNGBDBM225107(US9328118, 3)
Affinity DataIC50:  1nM. Assay description: First, spleen cells collected from C57BL/6 mice were seeded in a 96-well plate so as to be a 1× 105 cells/well, then, 5-fold dilution of 10 mM DMSO s...
Ligand InfoPC cidPC sid
In DepthDetails US Patent
TargetCathepsin S(Homo sapiens (Human))
Astellas Pharma
US Patent
LigandPNGBDBM225107(US9328118, 3)
Affinity DataIC50:  2.60nM. Assay description: 5 μL of a human cathepsin S enzyme (R&D1183-CY-010) was added to a 96-well plate so as to be 20 ng/well. Next, 10-fold dilution of the test comp...
Ligand InfoPC cidPC sid
In DepthDetails US Patent