BDBM225149 US9328118, 56
SMILES Cn1c(nc2c(nc(nc12)C#N)-c1cnc(OCCC2CCNCC2)c(c1)C(F)(F)F)C(F)(F)F
InChI Key InChIKey=OUMZPTFUDDDVOX-UHFFFAOYSA-N
Data  1 IC50
  Tab Delimited (TSV)   2D SDfile   Computed 3D by Vconf -m prep SDfile
Find this compound or compounds like it in BindingDB:
Activity Spreadsheet -- Enzyme Inhibition Constant Data from BindingDB
Found 1 hit for monomerid = 225149
TargetCathepsin S(Homo sapiens (Human))
Astellas Pharma
US Patent
LigandPNGBDBM225149(US9328118, 56)
Affinity DataIC50:  3.30nM. Assay description: 5 μL of a human cathepsin S enzyme (R&D1183-CY-010) was added to a 96-well plate so as to be 20 ng/well. Next, 10-fold dilution of the test comp...
Ligand InfoPC cidPC sid
In DepthDetails US Patent