BDBM225170 US9328118, 87
SMILES CCN1CCC(CCOc2ccc(cc2C#N)-c2nc(nc3n(CC4CCOC4)ccc23)C#N)CC1
InChI Key InChIKey=QMASUPBNHYUYNY-UHFFFAOYSA-N
Data  1 IC50
  Tab Delimited (TSV)   2D SDfile   Computed 3D by Vconf -m prep SDfile
Find this compound or compounds like it in BindingDB:
Activity Spreadsheet -- Enzyme Inhibition Constant Data from BindingDB
Found 1 hit for monomerid = 225170
TargetCathepsin S(Homo sapiens (Human))
Astellas Pharma
US Patent
LigandPNGBDBM225170(US9328118, 87)
Affinity DataIC50:  2.70nM. Assay description: 5 μL of a human cathepsin S enzyme (R&D1183-CY-010) was added to a 96-well plate so as to be 20 ng/well. Next, 10-fold dilution of the test comp...
Ligand InfoPC cidPC sid
In DepthDetails US Patent