BDBM225210 US9328118, 142
SMILES Cn1cnc2c(nc(nc12)C#N)-c1cnc(OCCC2CCN3CCCC3C2)c(c1)C(F)(F)F
InChI Key InChIKey=MHXMUGMWUHKTSL-UHFFFAOYSA-N
Data  1 IC50
  Tab Delimited (TSV)   2D SDfile   Computed 3D by Vconf -m prep SDfile
Find this compound or compounds like it in BindingDB:
Activity Spreadsheet -- Enzyme Inhibition Constant Data from BindingDB
Found 1 hit for monomerid = 225210
TargetCathepsin S(Homo sapiens (Human))
Astellas Pharma
US Patent
LigandPNGBDBM225210(US9328118, 142)
Affinity DataIC50:  1.5nM. Assay description: 5 μL of a human cathepsin S enzyme (R&D1183-CY-010) was added to a 96-well plate so as to be 20 ng/well. Next, 10-fold dilution of the test comp...
Ligand InfoPC cidPC sid
In DepthDetails US Patent