BDBM225240 3,5-Difluoro-N-(2-phenylbenzo[d]oxazol-6-yl)benzenesulfonamide (1)::PLCγ1-pep
SMILES CC(C)[C@H](NC(=O)[C@H](Cc1ccc(OP(O)(O)=O)cc1)NC(=O)[C@H](Cc1ccccc1)NC(=O)CNC(=O)[C@@H]1CCCN1C(=O)[C@@H](N)CC(N)=O)C(=O)N[C@@H](CCC(O)=O)C(=O)N[C@@H](C)C(=O)N[C@@H](CC(N)=O)C(O)=O
InChI Key InChIKey=VUCVFXXCAPKQPN-HNBYFKDQSA-N
Data  1 IC50  2 ITC
  Tab Delimited (TSV)   2D SDfile   Computed 3D by Vconf -m prep SDfile
Find this compound or compounds like it in BindingDB:
Activity Spreadsheet -- Enzyme Inhibition Constant Data from BindingDB
Found 1 hit for monomerid = 225240
TargetHistone-lysine N-methyltransferase EHMT2(Homo sapiens (Human))
Shenyang Pharmaceutical University
LigandPNGBDBM225240(3,5-Difluoro-N-(2-phenylbenzo[d]oxazol-6-yl)benzen...)
Affinity DataIC50:  3.32E+4nMpH: 8.5 T: 2°C. Assay description: Biochemical activity of G9a was measured as described [Kubicek et al., Mol. Cell, 25:473-481]. Assays were performed in white, opaque 384-well plates...
Ligand InfoKEGGPC cidPC sid
In DepthDetails ArticlePubMed
Activity Spreadsheet -- ITC Data from BindingDB
Found 2 hits for monomerid = 225240
CellPhospholipase C-γ1 SH2 domain (PLCC)(Homo sapiens (Human))
University Of Colorado Boulder
SyringePNGBDBM225240(3,5-Difluoro-N-(2-phenylbenzo[d]oxazol-6-yl)benzen...)
ITC DataΔG°: -12.7kcal/mole −TΔS°: 0.527kcal/mole ΔH°: -9.22kcal/mole logk: 2.21E+9
pH: 7.4 T: 25.00°C
Syringe InfoKEGGPC cidPC sid
CellPhospholipase C-γ1 SH2 domain (PLCC_R716E)(Homo sapiens (Human))
University Of Colorado Boulder
SyringePNGBDBM225240(3,5-Difluoro-N-(2-phenylbenzo[d]oxazol-6-yl)benzen...)
ITC DataΔG°: -11.1kcal/mole logk: 1.28E+8
pH: 7.4 T: 25.00°C
Syringe InfoKEGGPC cidPC sid