BDBM225351 Chk1_66
SMILES OC1CCC(CC1)NCc1ccc-2c(Cc3c-2n[nH]c3-c2ccc(o2)C(O)=O)c1
InChI Key InChIKey=MZQWYSZBWJZQEL-UHFFFAOYSA-N
Data  1 KI
  Tab Delimited (TSV)   2D SDfile   Computed 3D by Vconf -m prep SDfile
Find this compound or compounds like it in BindingDB:
Activity Spreadsheet -- Enzyme Inhibition Constant Data from BindingDB
Found 1 hit for monomerid = 225351
TargetSerine/threonine-protein kinase Chk1 [2-280](Homo sapiens (Human))
D3R/Abbott
LigandPNGBDBM225351(Chk1_66)
Affinity DataKi:  1.56E+3nM. Assay description: 33P-Radiometric_Method1
Ligand InfoPC cidPC sid
In DepthDetails PubMed