BDBM225354 Chk1_74
SMILES ONC(=O)c1ccc(cc1)-c1[nH]nc-2c1Cc1cc(CNC3CCC(O)CC3)ccc-21
InChI Key InChIKey=ZPAYGQBRTKSYQQ-UHFFFAOYSA-N
Data  1 KI
  Tab Delimited (TSV)   2D SDfile   Computed 3D by Vconf -m prep SDfile
Find this compound or compounds like it in BindingDB:
Activity Spreadsheet -- Enzyme Inhibition Constant Data from BindingDB
Found 1 hit for monomerid = 225354
TargetSerine/threonine-protein kinase Chk1 [2-280](Homo sapiens (Human))
D3R/Abbott
LigandPNGBDBM225354(Chk1_74)
Affinity DataKi:  55nM. Assay description: 33P-Radiometric_Method1
Ligand InfoPC cidPC sid
In DepthDetails PubMed