BDBM225672 GTC000444A
SMILES NC(=O)c1ccc(NCc2ccccc2)nc1
InChI Key InChIKey=JLARFNBDECTDMW-UHFFFAOYSA-N
Data  1 IC50
PDB links: 1 PDB ID matches this monomer.
  Tab Delimited (TSV)   2D SDfile   Computed 3D by Vconf -m prep SDfile
Find this compound or compounds like it in BindingDB:
Activity Spreadsheet -- Enzyme Inhibition Constant Data from BindingDB
Found 1 hit for monomerid = 225672
TargettRNA (guanine-N(1)-)-methyltransferase(Haemophilus influenzae (strain ATCC 51907 / DSM 11...)
D3R/Abbott
LigandPNGBDBM225672(GTC000444A)
Affinity DataIC50:  3.16E+3nM. Assay description: ScintillationProximity_Assay
Ligand InfoPC cidPC sidPDB