BDBM225929 FXR_18
SMILES CC(=O)Nc1cccc(c1)N([C@@H](C1CCCCC1)C(=O)NC1CCCCC1)C(=O)c1ccc(Cl)cc1
InChI Key InChIKey=GTILSQWOUVGGRG-MHZLTWQESA-N
Data  1 IC50
PDB links: 1 PDB ID matches this monomer.
  Tab Delimited (TSV)   2D SDfile   Computed 3D by Vconf -m prep SDfile
Find this compound or compounds like it in BindingDB:
Activity Spreadsheet -- Enzyme Inhibition Constant Data from BindingDB
Found 1 hit for monomerid = 225929
TargetBile acid receptor(Homo sapiens (Human))
D3R/Abbott
LigandPNGBDBM225929(FXR_18)
Affinity DataIC50:  6.28E+3nMpH: 7.4Assay Description:The assay buffer contained 50 mM HEPES (pH 7.4), 10 mM NaCl, 5 mM MgCl2 and 0.01% CHAPS. The reactions were incubated for 30 min in the presence of [...
Ligand InfoPC cidPC sidPDB